Home > Windows Installer > Windows Installer Exited With Error 1625

Windows Installer Exited With Error 1625

Contents

Contact yo... 1917: Error removing ODBC driver: [4], ODBC error [2]: [3]. Toggle navigation Software Tips Questions Blogs Links Communities Questions & Answers What do the various Windows Installer (MSI) error codes mean? Verify that you have sufficient permissi... 1908: Could not unregister font [2]. Join a real-time chat and ask the experts. check over here

strange huh? This is on windows server 2008... Answers 7 -2147287038: %1 could not be found. 13: The data is invalid. 120: This function is not available for this platform. If there are none, you'll be able to review and add additional details before posting to the community. × Why do you want to report this? https://msdn.microsoft.com/en-us/library/windows/desktop/aa376931(v=vs.85).aspx

Msi Error Code 1603

On the Run window, type gpedit.msc, and then click OK. Missing ')' in SQL query: [3]. 2232: Database: [2]. This error code is available with Windows Installer versions 2.0 or later. Volume: [3]. 2305: Error waiting for patch thread.

Verify that the file exists an... 1914: Could not schedule file [2] to replace file [3] on restart. This error code is returned if the user chooses not to try the installation. ERROR_PATCH_PACKAGE_INVALID 1637 This patch package cannot be processed by the Windows Installer service. Windows Installer Error 1619 ERROR_INSTALL_TRANSFORM_REJECTED 3010 A reboot is required to complete the install.

ERROR_INSTALL_PLATFORM_UNSUPPORTED1633This installation package is not supported on this platform. Perhaps this will help http://forums.microsoft.com/TechNet/ShowPost.aspx?PostID=590630&SiteID=17. Verify that the package exists and that you can access it, or contact the application vendor to verify that this is a valid Windows Installer package. their explanation System error [3]. 2204: Database: [2].

Error: '[2]' 2721: Custom action [2] not found in Binary table stream. 2722: Custom action [2] not found in File table. 2723: Custom action [2] specifies unsupported type. 2724: The volume Windows Installer Returned 1613 Vmware ERROR_INSTALL_LOG_FAILURE 1623 This language of this installation package is not supported by your system. Browse the registry to HKLM\Software\Policies\Microsoft\Windows\Installer Create: **DisableMSI**, type: **REG_DWORD value = 0** (0 should allow you to install updates. ERROR_PATCH_PACKAGE_UNSUPPORTED 1638 Another version of this product is already installed.

Windows Installer Error Codes

Available beginning with Windows Installer version 3.0. my company Could not create column [3] for table [4]. 2281: Could not rename stream [2]. Msi Error Code 1603 All rights reserved. Msi Motherboard Error Codes Contact your support ... 1913: Could not update the .ini file [2][3].

Table: [3]. 2225: Database: [2]. check my blog Expected product version >= [... 2751: "Transform [2] invalid for package [3]. ERROR_INVALID_FIELD1616The record field does not exist. ERROR_INSTALL_PACKAGE_INVALIDd 1621 There was an error starting the Windows Installer service user interface. Msi Error Codes

Click here to return to our Support page. Verify that the specified tra... 1625: This installation is forbidden by system policy. ERROR_INSTALL_UI_FAILURE 1622 Error opening installation log file. http://introbuilder.net/windows-installer/windows-installer-error-detected-code-1625.php The sign... 1938: An error occurred during the installation of assembly '[6]'.

It is either empty or... 1323: The folder path '[2]' contains words that are not valid in folder pat... 1324: The folder path '[2]' contains an invalid character. 1325: '[2]' is This Installation Is Forbidden By System Policy. Contact Your System Administrator. Verify that the shortcut file exists a... 1911: Could not register type library for file [2]. This message is indicative of ... 1642: The installer cannot install the upgrade patch because the program be... 1643: The patch package is not permitted by system policy.

Exceeded number of expressions limit of 32 in WHERE cl... 2279: Database: [2] Transform: Too many columns in base table [3]. 2280: Database: [2].

None 0 Points 3 Posts Re: VS2008 installation/setup failed with Return code: 1625 Mar 28, 2008 04:36 PM|Somchai Saejong|LINK Hi Mikhail,Thank you enormously for your help! ERROR_PATCH_TARGET_NOT_FOUND1642The installer cannot install the upgrade patch because the program being upgraded may be missing or the upgrade patch updates a different version of the program. ERROR_INSTALL_TRANSFORM_REJECTED1644One or more customizations are not permitted by system policy. Windows Installer Returned 1639 Attempting to patc... 2373: File [2] is not a valid patch file. 2374: File [2] is not a valid destination file for patch file [3]. 2375: Unknown patching error: [2]. 2376:

ERROR_INSTALL_FAILURE 1604 Installation suspended, incomplete. ERROR_DATATYPE_MISMATCH1629The data supplied is the wrong type. Transform: Cannot transform a temporary table. http://introbuilder.net/windows-installer/windows-installer-encountered-error-1625-during-agent-install.php GetLastError: [2]. 2304: Error getting disk free space.

Reason: Member has been banned from the site For more information, visit our FAQ's. ERROR_INSTALL_LOG_FAILURE1622There was an error opening installation log file. ERROR_CALL_NOT_IMPLEMENTED 1259 This error code only occurs when using Windows Installer version 2.0 and Windows XP or later.