Home > Windows Installer > Windows Installer Error 1624

Windows Installer Error 1624

Contents

Legal | Feedback 073948d Tue November 1 14:24:35 EDT 2016"www.itninja.com Log in Sign up! Sign up! Nothing to be done 13 ERROR_INVALID_DATA The data is invalid 87 ERROR_INVALID_PARAMETER One of the parameters was invalid. 1601 ERROR_INSTALL_SERVICE_FAILURE The Windows Installer service could not be accessed. Verify that the file exists an... 1914: Could not schedule file [2] to replace file [3] on restart. weblink

Expected upgrade code [4], fo... 2761: Cannot begin transaction. MergeDatabase: A reference to the base database was pa... 2274: Database: [2]. Verify that the program to be upgraded exists on your computer and that you have the correct upgrade patch. No columns in ORDER BY clause in SQL query: [3]. 2235: Database: [2]. https://social.technet.microsoft.com/Forums/windows/en-US/35889a69-a4fd-430d-8488-897d298da449/windows-installer-error-1624-error-applying-transforms?forum=w7itprogeneral

There Was An Error Applying Transforms. Verify That The Specified Transform Paths Are Valid.

System error: [3]. 2263: Could not open stream [2]. Multiple-Package Installations cannot run if rollback is disabled. Table could not be dropped: [3]. 2207: Database: [2].

How do I specify files to not be removed during uninstall? System error: [3]. 2262: Stream does not exist: [2]. Possible causes (but not exclusive): MST file is missing (or misspelled) MST file is not valid (mst internal errors) MST file is corrupted Solutions: Make sure the command line points to Windows Installer Cleanup Utility Databases are the same.

Like Show 0 Likes(0) Actions 8. Msi Error 1619 Re: Update Error: 1624 pjgfi Nov 24, 2010 6:08 AM (in response to Kwahaes) I had the same problem for days, here's what did the trick for me : there's a Verify that you have suff... 1924: Could not update environment variable '[2]'. http://www.msierrors.com/tag/msi-error-1624/ I get a message saying there is an update to install.

ERROR_INSTALL_UI_FAILURE1621There was an error starting the Windows Installer service user interface. Orca ERROR_DATATYPE_MISMATCH1629The data supplied is the wrong type. Specified Modify [3] operation invalid for table joins. 2276: Database: [2]. Invalid type specifier '[3]' in SQL query [4]. 2245: IStorage::Stat failed with error [3]. 2246: Database: [2].

Msi Error 1619

No action is taken. 2802: No publisher is found for the event [2]. 2803: Dialog View did not find a record for the dialog [2]. 2804: On activation of the control Skipping source '[2]'. 2929: Could not determine publishing root. There Was An Error Applying Transforms. Verify That The Specified Transform Paths Are Valid. A DLL require... 1724: Removal completed successfully. 1725: Removal failed. 1726: Advertisement completed successfully. 1727: Advertisement failed. 1728: Configuration completed successfully. 1729: Configuration failed. 1730: You must be an Administrator to Error 1624 Error Applying Transforms GetLastError: [2]. 2337: Could not close file: [3] GetLastError: [2]. 2338: Could not update resource for file: [3] GetLastError: [2]. 2339: Could not set file time for file: [3] GetLastError: [2].

Verify that the package exists and that you can access it, or contact the application vendor to verify that this is a valid Windows Installer package. http://introbuilder.net/windows-installer/windows-installer-error-109.php Contact your support... 1720: There is a problem with this Windows Installer package. ERROR_INSTALL_PACKAGE_REJECTED1625This installation is forbidden by system policy. Contact your support personnel. 1632 ERROR_INSTALL_TEMP_UNWRITABLE The temp folder is either full or inaccessible. Msi 1603

ERROR_SUCCESS_REBOOT_REQUIRED3010A restart is required to complete the install. For example if both 9.3.3 and 9.3.4 patches have been downloaded, install the 9.3.3 patch first followed by the 9.3.4 patch. Available beginning with Windows Installer version 3.0. http://introbuilder.net/windows-installer/windows-installer-help-error.php ERROR_PATCH_TARGET_NOT_FOUND1642The installer cannot install the upgrade patch because the program being upgraded may be missing or the upgrade patch updates a different version of the program.

ERROR_ROLLBACK_DISABLED 1653Could not perform a multiple-package transaction because rollback has been disabled. System error [4]. 1406: Could not write value [2] to key [3]. Unexpected token '[3]' in SQL query: [4]. 2233: Database: [2].

Available beginning with Windows Installer version 4.0.

Re: Update Error: 1624 DNesko48 Oct 13, 2010 11:33 AM (in response to Bojohnso) Here is the error window.Dan NesovicP:619-462-1077F:619-462-2943C:619-520-9639 Like Show 0 Likes(0) Actions 4. Complete that installation before proceeding with this install.For information about the mutex, see _MSIExecute Mutex. ERROR_PATCH_REMOVAL_DISALLOWED1649Patch removal was disallowed by policy. Reason: Member has been banned from the site For more information, visit our FAQ's.

GetLastError: [2]. 2333: Error setting file attributes. ERROR_CREATE_FAILED1631The Windows Installer service failed to start. We have situation where users aren't allowed to write to registry accept for HKEY_CURRENT_USER. –km1 Aug 30 '13 at 19:58 @km1 The installer would need to run with elevated http://introbuilder.net/windows-installer/windows-installer-pop-up-error.php System error: [3]. 2267: Could not delete storage [2].

DEBUG: Error 2759: Transform C:\WINNT\Installer\blahblah.mst version 301 incompatible with engineSolution: Install Windows installer 3.1 on the PC ( WindowsInstaller-KB893803-v2-x86.exe ) and re-try. Please log in to comment Rating comments in this legacy AppDeploy message board thread won't reorder them,so that the conversation will remain readable. Contact your support personnel. Solutions?

Error [2], network path ... 2370: "Invalid CRC checksum value for [2] file.{ Its header says [3] for ch... 2371: Could not apply patch to file [2]. MergeDatabase will not write any changes because the d... 2273: Database: [2]. This is on a Lenovo T400 notebook running Windows 7 Professional OS. Error codes for Windows Installer May 6, 2013 by admin 0 We're presenting below a list of exit codes that msiexec.exe returns and, in some cases, what to do to fix

Verify that you have sufficient permis... 1909: Could not create shortcut [2]. Tha... 1601: The Windows Installer Service Could Not Be Accessed 1601: The Windows Installer service could not be accessed. Though, I was hoping that I'd find a better answer than this. GetLastError() returned: [2]. 2896: Executing action [2] failed. 2897: Failed to create any [2] font on this system. 2898: For [2] textstyle, the system created a '[3]' font, in [4] character