Home > Windows Installer > Windows Installer 1639 Error

Windows Installer 1639 Error

Contents

The function returns the value ERROR_CALL_NOT_IMPLEMENTED. ERROR_INSTALL_PACKAGE_VERSION1613This installation package cannot be installed by the Windows Installer service. Generated Tue, 01 Nov 2016 18:52:25 GMT by s_wx1194 (squid/3.5.20) Developer resources Microsoft developer Windows Windows Dev Center Windows apps Desktop Internet of Things Games Holographic Microsoft Edge Hardware Azure Azure ERROR_INSTALL_PACKAGE_OPEN_FAILED1619This installation package could not be opened. weblink

MkElite 4,831,696 views 7:42 How To Fix Windows Installer Package Problem. (Chrome Remote Desktop - DLL Issue) - Duration: 3:32. ERROR_INSTALL_NOTUSED1634Component is not used on this machine. We appreciate your feedback. At the command prompt, type “msiexec /unregister”, and then press Enter.

Windows Installer Returned 1639

Advertisement Autoplay When autoplay is enabled, a suggested video will automatically play next. To patch an installed Administrator image, you should also use the /a switch/q n,b,r,f n - No UI b - Basic UI r - Reduced UI f - Full UI /y Facebook Twitter Google+ YouTube LinkedIn Tumblr Pinterest Newsletters RSS Skip navigation UploadSign inSearch Loading... Search ThreatTrack Security Support +877-757-4094 Home Solutions Forums Solution home General Windows Installer Errors MSI Error 1639: 'Invalid command line argument' during installation Modified on: Fri, 15 May, 2015 at 11:30

Reboot the computer and reinstall the program that you want. Verify that the source exists and that you can access it. Note: The message text for the Windows Installer error code 1639 is "Invalid command line argument." Solution: Solution This errorwill occur ifthere arespecial characters such as double quotation marks, extended characters, Error 1639 Dism Find and right-click the “Windows Installer”, and then click the “Properties”.

ERROR_INSTALL_LOG_FAILURE1622There was an error opening installation log file. Invalid Command Line Argument Windows Installer Sdk If you want to fix the error, just follow these steps below: Click the “Start” menu, and then click the “Run”. ERROR_PRODUCT_UNINSTALLED1614The product is uninstalled. Watch Queue Queue __count__/__total__ Psst...!

Verify that the patch package exists and is accessible, or contact the application vendor to verify that this is a valid Windows Installer patch package. An Error Occurred Installing The Package. Windows Installer Returned '1639' 2k14 Available beginning with Windows Installer version 3.0. All Rights Reserved. To resolve the error,run the installation again in a "clean boot" state whilelogged on to Windowsas User "Administrator".

Invalid Command Line Argument Windows Installer Sdk

Contact the application vendor to verify that this is a valid Windows Installer package. http://www.coopoint.com/articles/how-to-fix-windows-installer-error-1639 In the “Startup type”, select the “Automatic”, and then click “Apply” and “OK”. Windows Installer Returned 1639 Please try again later. Error 1639 Peachtree 2010 Loading...

Sign in to make your opinion count. have a peek at these guys Turn off ads with YouTube Red. Contact your support personnel. Required fields are marked *Comment Name * Email * Website two − = zero Copyright © 2006 - 2016 Coopoint. Error 1639 Windows Installer Sdk Peachtree

Available beginning with Windows Installer version 4.0. ERROR_PATCH_NO_SEQUENCE1648No valid sequence could be found for the set of patches. ERROR_INSTALL_SERVICE_FAILURE1601The Windows Installer service could not be accessed. check over here Chris Smoove 1,420,716 views 1:41:45 Would Michael Jordan have won without Scottie Pippen? - Duration: 8:29.

Available beginning with Windows Installer version 3.0. Command Prompt Error 1639 Contact your support personnel. Published on Oct 28, 2012NBA 2k13 an error occurred installing the package.

Available beginning with Windows Installer version 3.0.

Up next Michael Jordan Top 50 All Time Plays - Duration: 15:44. Available beginning with Windows Installer version 3.0. Here's how it works. Msi Error Codes Please see the Autodesk Creative Commons FAQ for more information.

NBA 7,205,277 views 3:05 NBA 2K13 My Career - Hall of Fame Verification! ERROR_INSTALL_USEREXIT1602The user cancels installation. ERROR_UNKNOWN_COMPONENT1607The component identifier is not registered. http://introbuilder.net/windows-installer/windows-installer-1639-error-nba-2k13.php For detailed instructions on performinga clean boot, referto one ofthe following web pages (depending on your operating system): Windows XP - http://support.microsoft.com/kb/310353/en-us Windows Vista - http://support.microsoft.com/kb/929135/en-us In addition, verify that the

All rights reserved Except where otherwise noted, work provided on Autodesk Knowledge Network is licensed under a Creative Commons Attribution-NonCommercial-ShareAlike 3.0 Unported License. This feature is not available right now. ERROR_ROLLBACK_DISABLED 1653Could not perform a multiple-package transaction because rollback has been disabled. Available beginning with Windows Installer version 3.0.

Downloads and tools Windows 10 dev tools Visual Studio Windows SDK Windows Store badges Essentials API reference (Windows apps) API reference (desktop apps) Code samples How-to guides (Windows apps) Learning resources Working... i tried that but it said to me that i dont need the update cause i already have the service pack with a newer one,if it could be able to install ERROR_PATCH_TARGET_NOT_FOUND1642The installer cannot install the upgrade patch because the program being upgraded may be missing or the upgrade patch updates a different version of the program.

The easiest way to resolve this would be to change the Temp folder to a new location. Contact the application vendor to verify that this is a valid Windows Installer patch package. The Chill Pill 16,510 views 7:44 5 Different Basketball Moves - Sedale Threatt Jr in UNGUARDABLE - Duration: 7:05. Verify that the specified transform paths are valid.

Uninstalling applications, applying updates and sometimes manual changes to some Windows components can cause these problems to surface. ERROR_FUNCTION_FAILED1627The function failed during execution. James Mighty 73,766 views 1:23 NBA 2K14 MyCareer Power Forward - The Rookie Showcase And Draft - Duration: 7:44. Freshdesk.

Track this discussion and email me when there are updates If you're asking for technical help, please be sure to include all your system info, including operating system, model number, and