Home > Windows Installer > Windows Installer 1602 Error

Windows Installer 1602 Error

Solution: just don't cancel it 1603 ERROR_INSTALL_FAILURE Fatal error during installation. Caution: Unless you an advanced PC user, we DO NOT recommend editing the Windows registry manually. Table: [3].   2225 Database: [2]. Table: [3].   2251 Database: [2] Transform: Cannot delete row that does not exist. http://introbuilder.net/windows-installer/windows-installer-error-1602.php

After you have successfully uninstalled your Error 1602-associated program (eg. ERROR_FUNCTION_FAILED 1628 Invalid or unknown table specified. This error is caused by a custom action that is based on Dynamic-Link Libraries. Intent to modify read only table: [3].   2258 Database: [2].

HRESULT: [3]. {{assembly interface: [4], function: [5], assembly name: [6]}} For more information, see Assemblies. HRESULT: [3]. {{assembly interface: [4], function: [5], component: [2]}} For more information, see Assemblies. Type "cleanmgr" and hit ENTER.

The file is then saved with a .reg file extension. ERROR_PRODUCT_UNINSTALLED 1615 SQL query syntax invalid or unsupported. Column '[3]' not present or ambiguous in SQL query: [4].   2236 Database: [2]. So if anyone else runs into this, might be worth trying to dig out the registry manually!

The InstallExecuteSequence may have been authored incorrectly. ERROR_INSTALL_TRANSFORM_FAILURE1624There was an error applying transforms. For Windows Me, see the InstallSFPCatalogFile action, the FileSFPCatalog table, and the SFPCatalog table. 2938 Windows Installer cannot retrieve a system file protection catalog from the cache. ERROR_UNSUPPORTED_TYPE1630Data of this type is not supported.

Complete that installation before proceeding with this install. For more information, see Using Windows Installer and Windows Resource Protection. Contact your system administrator. Contact your system administrator. 1626 ERROR_FUNCTION_NOT_CALLED Function could not be executed. 1627 ERROR_FUNCTION_FAILED Function failed during execution. 1628 ERROR_INVALID_TABLE Invalid or unknown table specified. 1629 ERROR_DATATYPE_MISMATCH Data supplied is of wrong

Verify that you have sufficient permissions to install fonts, and that the system supports this font.   1908 Could not unregister font [2]. Verify that you have sufficient permissions to remove fonts.   1909 Could not create shortcut [2]. Where "CheckPath" can be the CheckTargetPath, SetTargetPath or the CheckExistingTargetPath control events. 2873 On the dialog [2] the control [3] has an invalid string length limit: [4].   2874 Changing the From the File menu, choose Export.

Permalink 0 Jason Riker September 21, 2011 20:18 Shawn, Thanks for your help.  As to the minor version number, I'm not sure.  I'm download this file from Adobe's FTP site - http://introbuilder.net/windows-installer/windows-installer-error-detected-code-1602.php These 1602 error messages can appear during program installation, while a Microsoft Corporation-related software program (eg. Instructions for Windows XP: Open Programs and Features by clicking the Start button. ERROR_INSTALL_FAILURE1603A fatal error occurred during installation.

I ran the Microsoft Fixit utility at http://support.microsoft.com/mats/Program_Install_and_Uninstall (thanks Moab). Using a registry cleaner automates the process of finding invalid registry entries, missing file references (like the one causing your 1602 error), and broken links within the registry. Installer still closes. check over here ERROR_UNKNOWN_PROPERTY1608This is an unknown property.

Restore your computer. Go to the Search the Support Knowledge Base page and search for articles that discuss this Windows Installer error message. There is a pointer from both [3] and [5] to [4].   2811 On dialog [2] control [3] has to take focus, but it is unable to do so.   2812

Contact your support personnel. 1632 ERROR_INSTALL_TEMP_UNWRITABLE The temp folder is either full or inaccessible.

You must undo the changes made by that install to continue. Verify that the source exists and that you can access it. ERROR_INDEX_ABSENT1611The component qualifier not present. This error is returned if a feature that exceeds the maximum depth exists. 2702 A Feature table record ([2]) references a non-existent parent in the Attributes field.   2703 Property name

Sometimes resolving your Runtime Errors problems may be as simple as updating Windows with the latest Service Pack or other patch that Microsoft releases on an ongoing basis. Product Version: 7.0.20. System error code: [2]   1311 Could not locate source file cabinet: [2].   1312 Cannot create the directory '[2]'. this content When trouble-shooting the DLL you may need to use one or more of the tools described in KB198038. 2737 Could not access custom action [2], entry [3], library [4] This error

Verify that you have sufficient privileges to stop system services.   1922 Service '[2]' ([3]) could not be deleted. This message may be customized using the Error table. 1703 For the configuration changes made to [2] to take effect you must restart your system. Package version: [3], OS Protected version: [4] Windows Installer protects critical system files. ERROR_PATCH_PACKAGE_UNSUPPORTED1637This patch package cannot be processed by the Windows Installer service.

ERROR_INSTALL_PACKAGE_OPEN_FAILED 1620 This installation package could not be opened. A black box will open with a blinking cursor. The InstallExecuteSequence may have been authored incorrectly. You will be prompted with a permission dialog box.

Learn More Ghost Solution Suite 3.0 - "How-to" Videos We have created several "How To" videos and posted links on this page. You must install a Windows service pack that contains a newer version of the Windows Installer service. Available beginning with Windows Installer for Windows Server 2003. 1937 An error occurred during the installation of assembly '[6]'. ERROR_PRODUCT_VERSION1638Another version of this product is already installed.

Expected product version < [4], found product version [5].   2748 Transform [2] invalid for package [3]. When trouble-shooting the DLL you may need to use one or more of the tools described in KB198038. 2743 Could not execute custom action [2], location: [3], command: [4]. A DLL required for this install to complete could not be run. Exit Safe Mode and try again or try using System Restore to return your computer to a previous state.

A Windows Installer package, patch, or transform that has not been signed by Microsoft cannot be installed on an ARM computer. Go to the Search the Support Knowledge Base page and search for articles that discuss this Windows Installer error message. Extended error: network provider [5], error code [4], error description [6].   2370 Invalid CRC checksum value for [2] file.{ Its header says [3] for checksum, its computed value is [4].} This is an invalid or duplicate value.   2879 The control [3] on dialog [2] cannot parse the mask string: [4].   2880 Do not perform the remaining control events.  

Complete that installation before proceeding with this install. You will be prompted with a permission dialog box. Browse other questions tagged windows-registry windows-installer or ask your own question.