Home > Error Code > Windows Installer Error 1937

Windows Installer Error 1937

Contents

Transaction not started. 2765: Assembly name missing from AssemblyName table : Component: [4]. 2766: The file [2] is an invalid MSI storage file. 2767: No more data{ while enumerating [2]}. 2768: tadeumaia commented May 7, 2014 @LeoColomb Try npm install runas Should show more debug log. GetLastError: [2]. 2307: Source file key name is null. 2308: Destination file name is null. 2309: Attempting to patch file [2] when patch already in progress. 2310: Attempting to continue patch For more information, see System Reboots and Logging of Reboot Requests. 1904 Module [2] failed to register. weblink

Database not in writable state. 2213: Database: [2]. Created: 07/03/2005 Updated: 09/10/2016 Error 1935: "An Error Occurred in the Installation of Assembly Policy" Disclaimer: This article was written about products for which Sage Software, Inc. qJake commented May 6, 2014 @kevinsawicki Pull request created: #1941 qJake commented May 6, 2014 @Shockzz Try the updated instructions in the pull request, it instructs you to actually download Git The first time I tried to install it the progress went about half way time I got this: Error 1937 then I tried again and the progression bar never even moved https://msdn.microsoft.com/en-us/library/windows/desktop/aa372835(v=vs.85).aspx

Msi Installer Error Codes

I will have to first install the SDK to get the gacutil. Intent to modify read only table: [3].   2258 Database: [2]. MergeDatabase: Unable to write errors to Error table.

Available beginning with Windows Installer version 3.0. 2772 New upgrade feature [2] must be a leaf feature. GetLastError: [2]. 2306: Could not create thread for patch application. Expected product version < [4... 2748: "Transform [2] invalid for package [3]. Msi Error Code 1603 configure error gyp ERR!

Available beginning with Windows Installer version 3.0. Error 2732 Directory Manager Not Initialized Created: 01/13/2010 Updated: 09/10/2016 Error: "29503 The SQL Server service failed to start." or "SQL Express Install fails Error 29503 / 1067" When Attempting to install ACT! System error: [3]. 2266: Could not rollback storage. MsiExec.exe and InstMsi.exe Error Messages These error codes are returned by the Windows Installer functions MsiExec.exe and InstMsi.exe.

This is an invalid or duplicate value.   2879 The control [3] on dialog [2] cannot parse the mask string: [4].   2880 Do not perform the remaining control events.   Failed To End A Windows Installer Transaction . Error 5 Occurred While Ending The Transaction Cause: This issue can be caused by missing or damaged Microsoft .NET Framework 4 files Solution: Note: This information is provided as a convenience. stack at maybeClose (child_process.js:743:16) gyp ERR! TB 39 builds of master for 10th and 11th of September install without issue.

Error 2732 Directory Manager Not Initialized

Merge: The column count differed in the '[3]' table of the two databases.   2270 Database: [2]. http://www.itninja.com/question/what-does-this-msi-error-mean Only one of them should be present. Msi Installer Error Codes Verify that you have sufficient privileges to modify the security permissions for this file.   1927 The installation requires COM+ Services to be installed.   1928 The installation failed to install Windows Installer Error Codes The last error also stated "set up can not find file c:\Program Files\Microsoft...

Error saving database tables.   2214 Database: [2]. http://introbuilder.net/error-code/windows-installer-error-1807.php command "c:\\Program Files (x86)\\nodejs\\\\node.exe" "c:\\Program File s (x86)\\nodejs\\node_modules\\npm\\bin\\npm-cli.js" "--userconfig=e:\\atom-mast er\\atom-master\\.npmrc" "install" "--quiet" npm ERR! Global mutex not properly initialized. 2762: Cannot write script record. Transaction not started. Error 2732.directory Manager Not Initialized Fix

not with npm itself. Before atempting to install Sage ACT! WARNING! check over here ERROR_INSTALL_PLATFORM_UNSUPPORTED1633This installation package is not supported on this platform.

Go to start, run and type regedit, then navigate to - HKLM\System\CurrentControlSet\Control\Se... Msi Motherboard Error Codes bumblebeeman commented May 6, 2014 @kevinsawicki Thanks for the response, do you the runas error is a VS one or something else? Type mismatch in parameter: [3].   2259 Database: [2] Table(s) Update failed Queries must adhere to the restricted Windows Installer SQL syntax. 2260 Storage CopyTo failed.

Available beginning with Windows Installer version 3.0.

Premium (Web) Outlook Integration This issue can be resolved by the addition of the 2 attached files to the server hosting the APFW website and reinstalling the Sage ACT! ERROR_INSTALL_USEREXIT1602The user cancels installation. Check to make sure enough disk space is available, and click Retry, or Cancel to end the install.   1712 One or more of the files required to restore your computer Msi Error 1708 Verify that you... 1918: Error installing ODBC driver: [4], ODBC error [2]: [3].

There is likely additional logging output above. Repeated table '[3]' in SQL query: [4].   2231 Database: [2]. Available beginning with Windows Installer 5.0 for Windows 7 and Windows Server 2008 R2. 1944 Could not set security for service '[3]'. this content FL studio question help?

Well done Devs! ;) « Return to QA | 1 view|%1 views Loading... Expected upgrade code [4], found [5].   2761 Cannot begin transaction. The sytem does not have GacUtility for .Net 4.5. Downloads and tools Windows 10 dev tools Visual Studio Windows SDK Windows Store badges Essentials API reference (Windows apps) API reference (desktop apps) Code samples How-to guides (Windows apps) Learning resources

npm ERR! Repeated table '[3]' in SQL query: [4]. 2231: Database: [2]. See ASP.NET Ajax CDN Terms of Use – http://www.asp.net/ajaxlibrary/CDN.ashx. ]]> {{offlineMessage}} Store Store home Devices Microsoft Surface PCs & In the "For:" pane, enter a character string like the following, with quotes enclosing the words Windows Installer, the appropriate Message Code value from the following table, and the keyword "kberrmsg".

If you need... gyp gypnpm ERR! Failed at the [email protected] install script.