Home > Error Code > Windows Code Error 1

Windows Code Error 1

Contents

Invalid info: [2]. During this process [ERROR_COMMITMENT_MINIMUM (0x27B)]Error Code 636: A device was removed so enumeration must be restarted. [ERROR_PNP_RESTART_ENUMERATION (0x27C)]Error Code 637: {Fatal System Error} The system image %s is not properly signed. The language ID that is specified by the ProductLanguage property must be contained in the Template Summary property. Free up space on the drive or verify that you have write permission on the Temp folder. 1633 This installation package is not supported by this processor type. have a peek here

Contact your support personnel or package vendor. Select "Search Product: All Products" to perform a comprehensive search for the message. Test packages in high-traffic environments where users request the installation of many applications. That user will need to run that install again before they can use that product.

Windows Error Codes List

It is corrupt [ERROR_CANNOT_LOAD_REGISTRY_FILE (0x24D)]Error Code 590: {Unexpected Failure in DebugActiveProcess} An unexpected failure occurred while processing a DebugActiveProcess API request. Sign in 1 0 Don't like this video? Get it now! Invalid row/field data.   2221 Database: [2].

The relocation occurred because the DLL %hs occupied an address range reserved for Windows system DLLs. The system has been shut down. [ERROR_SYSTEM_IMAGE_BAD_SIGNATURE (0x27D)]Error Code 638: Device will not start without a reboot. [ERROR_PNP_REBOOT_REQUIRED (0x27E)]Error Code 639: There is not enough power to complete the requested operation. Missing ')' in SQL query: [3].   2232 Database: [2]. Error Code List Sign in Transcript Statistics 827 views 0 Like this video?

You may choose OK to terminate the process [ERROR_DEBUG_ATTACH_FAILED (0x24E)]Error Code 591: {Fatal System Error} The %hs system process terminated unexpectedly with a status of 0x%08x (0x%08x 0x%08x). Windows Error Codes Lookup Expected language [4], found language [5]. If a piece of hardware is malfunctioning, you will almost always be alerted through the Device Manager. https://msdn.microsoft.com/en-us/library/windows/desktop/ms681383(v=vs.85).aspx Bademeisterization 9,269,161 views 1:11 No audio output device is installed.Windows 7 audio problem? - Duration: 3:17.

Transform or merge code page [3] differs from database code page [4].   2223 Database: [2]. Windows Update Error Codes Check your computer's system information to see whether you need a x86 (32-bit) or x64 (64-bit) version of the program, and then contact the software publisher. [ERROR_EXE_MACHINE_TYPE_MISMATCH (0xD8)]Error Code 217: The Loading... The selection manager is responsible for determining component and feature states.

Windows Error Codes Lookup

Selecting OK will cause the service to continue operation. http://www.symantec.com/connect/articles/windows-system-error-codes-exit-codes-description Perform package validation and check for ICE80. 2746 Transform [2] invalid for package [3]. Windows Error Codes List If the service SID type for this service was just configured, the hosting process must be restarted in order to start this service. Windows Error Codes 0x Code Description 0 The operation completed successfully. 1 Incorrect function. 2 The system cannot find the file specified. 3 The system cannot find the path specified. 4 The system cannot open

Contact your support personnel. navigate here Please refer to Help and Support for more information. Changes will not be effective until the system is rebooted. 3011 The requested operation is successful. Loading... What Is Error Code -50

Transform failed.   2227 Database: [2]. About Us Contact Us Privacy Policy Advertisers Business Partners Media Kit Corporate Site Experts Reprints Archive Site Map Answers E-Products Events Features Guides Opinions Photo Stories Quizzes Tips Tutorials Videos All You will notice that the error codes are not sequential. Check This Out The scheduled system restart message when other users are logged on the computer.

When trouble-shooting the DLL you may need to use one or more of the tools described in KB198038. 2744 EXE failed called by custom action [2], location: [3], command: [4]. Windows Blue Screen Error Codes You must install a Windows service pack that contains a newer version of the Windows Installer service. 1614 Product is uninstalled. 1615 SQL query syntax invalid or unsupported. 1616 Record field and Canada is 1-877-524-9644 and for the U.K.

Ask me anything you don't understand.

Transaction not started.   2765 Assembly name missing from AssemblyName table : Component: [4].   2766 The file [2] is an invalid MSI storage file.   2767 No more data{ while To use all processors the operating system restricts itself to the features of the least capable processor in the system. Please contact your system vendor for system BIOS update. [ERROR_PNP_BAD_MPS_TABLE (0x29F)]Error Code 672: A translator failed to translate resources. [ERROR_PNP_TRANSLATION_FAILED (0x2A0)]Error Code 673: A IRQ translator failed to translate resources. [ERROR_PNP_IRQ_TRANSLATION_FAILED Microsoft Error Codes Xbox but it works some times , but u have to be patient until it works :/ I wish they solve it Reply Share Share this post on Digg Del.icio.us Technorati Twitter

The join or form operation was aborted. 5078 The specified resource type was not found. 5079 The specified node does not support a resource of this type. Before opening files in this location, you must first add the web site to your trusted sites list, browse to the web site, and select the option to login automatically. Up next Fix No Audio Output Device Is Installed Errors - Duration: 12:54. this contact form Where "CheckPath" can be the CheckTargetPath, SetTargetPath or the CheckExistingTargetPath control events. 2873 On the dialog [2] the control [3] has an invalid string length limit: [4].   2874 Changing the

HowtoSupport 30,426 views 1:17 NO AUDIO OUTPUT DEVICE IS INSTALLED[SOLVED 100%] - Duration: 3:12. Verify that you have sufficient privileges to modify the security permissions for this file.   1927 The installation requires COM+ Services to be installed.   1928 The installation failed to install In all of my years working with Windows XP, I have seen only one system that was so low on memory that a device driver refused to load, and that problem For more information, see _MSIExecute Mutex. 1601 Out of disk space -- Volume: '[2]'; required space: [3] KB; available space: [4] KB Ensure that the custom action costs do not exceed

Error [3].   2935 Could not unsecure transform [2]. In Windows XP, the Device Manager is a centralized console for configuring all of your system's hardware. GetLastError() returned: [2].   2895 Freeing RICHED20.DLL failed. System error [3].   2204 Database: [2].

Action: [2], location: [3], command: [4]   1722 There is a problem with this Windows Installer package. For more information, see System Reboots. 1608 Could not find any previously installed compliant products on the machine for installing this product No file listed in the CCPSearch table can be Do you want to restart now? Downloads and tools Windows 10 dev tools Visual Studio Windows SDK Windows Store badges Essentials API reference (Windows apps) API reference (desktop apps) Code samples How-to guides (Windows apps) Learning resources

For example [ERROR_TOO_MANY_THREADS (0x235)]Error Code 566: An attempt was made to operate on a thread within a specific process [ERROR_THREAD_NOT_IN_PROCESS (0x236)]Error Code 567: Page file quota was exceeded. [ERROR_PAGEFILE_QUOTA_EXCEEDED (0x237)]Error Code The execute method should not be called on it.   2854 On the dialog [2] the control [3] is designated as first active control, but there is no such control.   If Windows still cannot find the network path contact your network administrator. [ERROR_REM_NOT_LIST (0x33)]Error Code 52: You were not connected because a duplicate name exists on the network. Insufficient values in INSERT SQL statement.   2240 Database: [2].

ERROR CODE 1- SUCCESS and Failure to connect!!!!!!!! The maximum depth of any feature is 16. The calling process has not registered as a logon process. 1363 Cannot start a new logon session with an ID that is already in use. 1364 A specified authentication package is The value [4] exceeds this limit, and has been truncated.   2894 Loading RICHED20.DLL failed.

Invalid type specifier '[3]' in SQL query [4].   2245 IStorage::Stat failed with error [3].   2246 Database: [2]. System error: [3].   2268 Database: [2].